Azure Sphere Demo Build Error

Welcome to ask questions or discuss anything related to Azure Sphere products

Moderators: lily.li, violet, seth.welday

Post Reply
garymok
Pre-kindergarten
Pre-kindergarten
Posts: 3
Joined: Wed Feb 12, 2014 3:18 pm

Azure Sphere Demo Build Error

Post by garymok » Wed Oct 17, 2018 11:51 am

When I follow the example:
http://wiki.seeedstudio.com/Azure_Spher ... phere-demo

to build the following example from Visual Studio 2017:
https://github.com/Seeed-Studio/Azure_S ... _Smart_Fan

I got the following error:

1>------ Rebuild All started: Project: AzureSphereDemo2, Configuration: Debug ARM ------
1>arm-poky-linux-musleabi-gcc.exe : error : crypt32.lib: No such file or directory
1>arm-poky-linux-musleabi-gcc.exe : error : winhttp.lib: No such file or directory
1>arm-poky-linux-musleabi-gcc.exe : error : Secur32.lib: No such file or directory
1>arm-poky-linux-musleabi-gcc.exe : error : ncrypt.lib: No such file or directory
1>arm-poky-linux-musleabi-gcc.exe : error : Ws2_32.lib: No such file or directory
1>arm-poky-linux-musleabi-gcc.exe : error : Rpcrt4.lib: No such file or directory
1>Done building project "AzureSphereDemo2.vcxproj" -- FAILED.
========== Rebuild All: 0 succeeded, 1 failed, 0 skipped ==========

Please advise what I am missing.

takashi
Pre-kindergarten
Pre-kindergarten
Posts: 6
Joined: Fri Apr 06, 2018 9:25 am

Re: Azure Sphere Demo Build Error

Post by takashi » Mon Nov 19, 2018 8:53 am

Hi, garymok.

Can you build and run the Azure IoT Hub Sample for MT3620 RDB project in Azure Sphere Preview SDK?
https://docs.microsoft.com/en-us/azure- ... iot-sample

baqwas
Pre-kindergarten
Pre-kindergarten
Posts: 31
Joined: Tue Dec 29, 2015 4:28 am

Re: Azure Sphere Demo Build Error

Post by baqwas » Thu Nov 29, 2018 9:34 am

I had success earlier this week (v18.11, I believe). Would you like me to send you screen shots?

Regards.

User avatar
andre.ml.curvello
Pre-kindergarten
Pre-kindergarten
Posts: 14
Joined: Thu May 10, 2018 7:19 pm
Contact:

Re: Azure Sphere Demo Build Error

Post by andre.ml.curvello » Sun Dec 16, 2018 6:34 pm

Hi @garymok, how are you?

Look, that appears that you had not setup properly your environment.
Have you installed the latest Azure Sphere SDK?
And... Have you upgraded your board to the Firmware 18.11?

Mine is working here in the following setup:
- Visual Studio 2017
- Azure Sphere SDK 18.11
- Azure Sphere Kit upgraded to 18.11

If you have any problem, post it here and I'll try to help you.

Best,
Andre Curvello

baqwas
Pre-kindergarten
Pre-kindergarten
Posts: 31
Joined: Tue Dec 29, 2015 4:28 am

Re: Azure Sphere Demo Build Error

Post by baqwas » Wed Dec 19, 2018 11:20 pm

Hello Gary,

My two bits, if you please, on a similar issue. My Visual Studio Extensions had not been installed properly when I encountered a set of similar messages.

My fix (since it was a crash-and-burn desktop) was to uninstall the extensions and Visual Studio, reboot and then start the pre-requisite steps in a more deliberate manner as outlined at https://docs.microsoft.com/en-us/azure- ... nvironment

Hope this helps. I would recommend that you use the Azure command line operations to validate your environment because after attaining success there, the samples worked flawlessly for me.

Regards.

teleworm1337
Pre-kindergarten
Pre-kindergarten
Posts: 1
Joined: Fri Jan 18, 2019 6:22 pm

Re: Azure Sphere Demo Build Error

Post by teleworm1337 » Fri Jan 18, 2019 6:25 pm

Can you build and run the Azure IoT Hub Sample for MT3620 RDB project in Azure Sphere Preview SDK?

androlee.com
Pre-kindergarten
Pre-kindergarten
Posts: 1
Joined: Tue Feb 05, 2019 4:53 pm

Re: Azure Sphere Demo Build Error

Post by androlee.com » Tue Feb 05, 2019 4:55 pm

Have you ever tried cartoon movie and TV shows in your Android Mobile phone?
You can easily give access to Cartoon HD for free and enjoy all the latest movies and TV shows for free

Post Reply